# Getting error "linker command failed with exit code 1 (use -v to see invocation)

**URL:** <https://discuss.appium.io/t/getting-error-linker-command-failed-with-exit-code-1-use-v-to-see-invocation/13894>\
**Category:** Support\
**Created:** [December 21, 2016, 4:45pm UTC](https://discuss.appium.io/t/getting-error-linker-command-failed-with-exit-code-1-use-v-to-see-invocation/13894 "2016-12-21T16:45:08Z")\
**Posts on this page:** 16\
**Page:** 1

<div class="post-metadata">

**Author:** ![jtangadagi](https://discuss.appium.io/letter_avatar_proxy/v4/letter/j/cab0a1/32.png) [@jtangadagi](https://discuss.appium.io/u/jtangadagi)\
**Post date:** [December 21, 2016, 4:45pm UTC](https://discuss.appium.io/t/getting-error-linker-command-failed-with-exit-code-1-use-v-to-see-invocation/13894/1 "2016-12-21T16:45:08Z")

</div>

I am trying to run my program on eclipse and getting the above error. Looks like it is an issue with the build phase in xcode. While I try to build the WebDriverAgent.xcodeproj - It is throwing the above error.

**Here is the screenshot of the error I am seeing on the xcode build phase:**

 ![](https://discuss.appium.io/uploads/default/original/2X/8/86c80a105c813fdc5d9a0e8d61280978b2d19931.png)

**Environment:**

Appium version : 1.6.3  
OSX : 10.12  
Xcode : 8.2  
Ipad iOS : 9.3.1

**This is the error on eclipse console:**

WebDriverException: Message: u’An unknown server-side error occurred while processing the command. Original error: xcodebuild failed with code 65’

**This is the appium logs :**

ebs-macbook-air:~ EB\_QA\_AUTO$ appium  
[Appium] Welcome to Appium v1.6.3 (REV 88e577b9549f724fdd459ac190079a5384d50e62)  
[Appium] Appium REST http interface listener started on 0.0.0.0:4723  
[HTTP] --\> POST /wd/hub/session {“sessionId”:null,“desiredCapabilities”:{“deviceName”:“daus iPad”,“udid”:“bcaf54\*\*\*\*\*\*\*\*\*\*\*\*\*\*\*\*\*\*\*\*\*\*\*\*\*\*\*\*\*\*\*\*\*\*\*\*\*\*\*\*\*\*\*\*\*\*\*\*\*\*\*\*”,“automationName”:“XCUITest”,“browserName”:“Safari”,“xcodeConfigFile”:"/Users/EB\_QA\_AUTO/node\_modules/appium-xcuitest-driver/myconfig.xcconfig",“platformVersion”:“9.3”,“platformName”:“iOS”}}  
[debug] [MJSONWP] Calling AppiumDriver.createSession() with args: [{“deviceName”:“daus iPad”,“udid”:“bcaf54\*\*\*\*\*\*\*\*\*\*\*\*\*\*\*\*\*\*\*\*\*\*\*\*\*\*\*\*\*\*\*\*\*\*\*\*\*\*\*\*\*\*\*\*\*\*\*\*\*\*\*\*”,“automationName”:“XCUITest”,“browserName”:“Safari”,“xcodeConfigFile”:"/Users/EB\_QA\_AUTO/node\_modules/appium-xcuitest-driver/myconfig.xcconfig",“platformVersion”:“9.3”,“platformName”:“iOS”},null,null,null,null]  
[Appium] Creating new XCUITestDriver session  
[Appium] Capabilities:  
[Appium] deviceName: ‘daus iPad’  
[Appium] udid: ‘bcaf54\*\*\*\*\*\*\*\*\*\*\*\*\*\*\*\*\*\*\*\*\*\*\*\*\*\*\*\*\*\*\*\*\*\*\*\*\*\*\*\*\*\*\*\*\*\*\*\*\*\*\*\*’  
[Appium] automationName: ‘XCUITest’  
[Appium] browserName: ‘Safari’  
[Appium] xcodeConfigFile: ‘/Users/EB\_QA\_AUTO/node\_modules/appium-xcuitest-driver/myconfig.xcconfig’  
[Appium] platformVersion: ‘9.3’  
[Appium] platformName: ‘iOS’  
[debug] [XCUITest] XCUITestDriver version: 2.4.2  
[BaseDriver] Session created with session id: 43dbb919-bf6c-4879-be27-3b5897761767  
[debug] [XCUITest] Xcode version set to ‘8.2’  
[debug] [XCUITest] iOS SDK Version set to ‘10.2’  
[debug] [XCUITest] Available devices: bcaf54\*\*\*\*\*\*\*\*\*\*\*\*\*\*\*\*\*\*\*\*\*\*\*\*\*\*\*\*\*\*\*\*\*\*\*\*\*\*\*\*\*\*\*\*\*\*\*\*\*\*\*\*  
[debug] [XCUITest] Creating iDevice object with udid bcaf54\*\*\*\*\*\*\*\*\*\*\*\*\*\*\*\*\*\*\*\*\*\*\*\*\*\*\*\*\*\*\*\*\*\*\*\*\*\*\*\*\*\*\*\*\*\*\*\*\*\*\*\*  
[XCUITest] Determining device to run tests on: udid: ‘bcaf54\*\*\*\*\*\*\*\*\*\*\*\*\*\*\*\*\*\*\*\*\*\*\*\*\*\*\*\*\*\*\*\*\*\*\*\*\*\*\*\*\*\*\*\*\*\*\*\*\*\*\*\*’, real device: true  
[XCUITest] Safari test requested  
[debug] [iOSLog] Attempting iOS device log capture via libimobiledevice idevicesyslog  
[debug] [iOSLog] Found idevicesyslog: ‘/usr/local/bin/idevicesyslog’  
[XCUITest] Setting up real device  
[XCUITest] Using WDA path: ‘/usr/local/lib/node\_modules/appium/node\_modules/appium-xcuitest-driver/WebDriverAgent’  
[XCUITest] Using WDA agent: ‘/usr/local/lib/node\_modules/appium/node\_modules/appium-xcuitest-driver/WebDriverAgent/WebDriverAgent.xcodeproj’  
[XCUITest] Launching WebDriverAgent on the device  
[debug] [XCUITest] Carthage found: /usr/local/bin/carthage  
[debug] [XCUITest] Killing hanging processes  
[debug] [XCUITest] Using real device logger ‘idevicesyslog’  
[debug] [XCUITest] Using Xcode configuration file: ‘/Users/EB\_QA\_AUTO/node\_modules/appium-xcuitest-driver/myconfig.xcconfig’  
[debug] [XCUITest] Beginning test with command ‘xcodebuild build test -project /usr/local/lib/node\_modules/appium/node\_modules/appium-xcuitest-driver/WebDriverAgent/WebDriverAgent.xcodeproj -scheme WebDriverAgentRunner -destination id=bcaf54bb6bd7b75b085a4f3dd0f2b034de0d41fa -configuration Debug -xcconfig /Users/EB\_QA\_AUTO/node\_modules/appium-xcuitest-driver/myconfig.xcconfig’ in directory ‘/usr/local/lib/node\_modules/appium/node\_modules/appium-xcuitest-driver/WebDriverAgent’  
[XCUITest] Waiting for WebDriverAgent to start on device  
[debug] [XCUITest] Log file for xcodebuild test: /Users/EB\_QA\_AUTO/Library/Developer/Xcode/DerivedData/WebDriverAgent-brdadhpuduowllgivnnvuygpwhzy/Logs/Test/89CD2E2F-2899-4C41-8004-837311D69760/Session-WebDriverAgentRunner-2016-12-21\_103815-vHKV41.log  
[Xcode] 2016-12-21 10:38:16.238 xcodebuild[4699:101823] Error Domain=IDETestOperationsObserverErrorDomain Code=3 “Test operation was canceled. If you believe this error represents a bug, please attach the log file at /Users/EB\_QA\_AUTO/Library/Developer/Xcode/DerivedData/WebDriverAgent-brdadhpuduowllgivnnvuygpwhzy/Logs/Test/89CD2E2F-2899-4C41-8004-837311D69760/Session-WebDriverAgentRunner-2016-12-21\_103815-vHKV41.log” UserInfo={NSLocalizedDescription=Test operation was canceled. If you believe this error represents a bug, please attach the log file at /Users/EB\_QA\_AUTO/Library/Developer/Xcode/DerivedData/WebDriverAgent-brdadhpuduowllgivnnvuygpwhzy/Logs/Test/89CD2E2F-2899-4C41-8004-837311D69760/Session-WebDriverAgentRunner-2016-12-21\_103815-vHKV41.log}

[Xcode]  
Testing failed:

[Xcode] No signing certificate “iOS Development” found: No “iOS Development” signing certificate matching team ID “\<6P7\*\*\*\*\*\*\*\*\*\*\*\*\*\*\>” with a private key was found.  
\*\* TEST FAILED \*\*

The following build commands failed:  
Check dependencies  
(1 failure)

[XCUITest] xcodebuild exited with code ‘65’ and signal ‘null’  
[debug] [XCUITest] xcodebuild failure warrants retry. Retrying…  
[XCUITest] Shutting down sub-processes  
[XCUITest] Shutting down Logger process (pid 4700)  
[XCUITest] System log exited with code ‘0’  
[debug] [XCUITest] Removing WDA application from device  
[XCUITest] Launching WebDriverAgent on the device  
[debug] [XCUITest] Carthage found: /usr/local/bin/carthage  
[debug] [XCUITest] Killing hanging processes  
[debug] [XCUITest] Using real device logger ‘idevicesyslog’  
[debug] [XCUITest] Using Xcode configuration file: ‘/Users/EB\_QA\_AUTO/node\_modules/appium-xcuitest-driver/myconfig.xcconfig’  
[debug] [XCUITest] Beginning test with command ‘xcodebuild build test -project /usr/local/lib/node\_modules/appium/node\_modules/appium-xcuitest-driver/WebDriverAgent/WebDriverAgent.xcodeproj -scheme WebDriverAgentRunner -destination id=bcaf54bb6bd7b75b085a4f3dd0f2b034de0d41fa -configuration Debug -xcconfig /Users/EB\_QA\_AUTO/node\_modules/appium-xcuitest-driver/myconfig.xcconfig’ in directory ‘/usr/local/lib/node\_modules/appium/node\_modules/appium-xcuitest-driver/WebDriverAgent’  
[XCUITest] Waiting for WebDriverAgent to start on device  
[debug] [XCUITest] Log file for xcodebuild test: /Users/EB\_QA\_AUTO/Library/Developer/Xcode/DerivedData/WebDriverAgent-brdadhpuduowllgivnnvuygpwhzy/Logs/Test/18C85F44-E85A-4FE5-9D5F-3A0C8EA13DD1/Session-WebDriverAgentRunner-2016-12-21\_103820-OPYLS5.log  
[Xcode] 2016-12-21 10:38:21.782 xcodebuild[4737:101926] Error Domain=IDETestOperationsObserverErrorDomain Code=3 “Test operation was canceled. If you believe this error represents a bug, please attach the log file at /Users/EB\_QA\_AUTO/Library/Developer/Xcode/DerivedData/WebDriverAgent-brdadhpuduowllgivnnvuygpwhzy/Logs/Test/18C85F44-E85A-4FE5-9D5F-3A0C8EA13DD1/Session-WebDriverAgentRunner-2016-12-21\_103820-OPYLS5.log” UserInfo={NSLocalizedDescription=Test operation was canceled. If you believe this error represents a bug, please attach the log file at /Users/EB\_QA\_AUTO/Library/Developer/Xcode/DerivedData/WebDriverAgent-brdadhpuduowllgivnnvuygpwhzy/Logs/Test/18C85F44-E85A-4FE5-9D5F-3A0C8EA13DD1/Session-WebDriverAgentRunner-2016-12-21\_103820-OPYLS5.log}

[Xcode]  
Testing failed:

[Xcode] No signing certificate “iOS Development” found: No “iOS Development” signing certificate matching team ID “\<6P7\*\*\*\*\*\*\*\*\*\*\*\*\*\*\>” with a private key was found.  
\*\* TEST FAILED \*\*

The following build commands failed:  
Check dependencies  
(1 failure)

[XCUITest] xcodebuild exited with code ‘65’ and signal ‘null’  
[XCUITest] Error: xcodebuild failed with code 65  
at SubProcess. (…/…/lib/webdriveragent.js:355:25)  
at emitTwo (events.js:106:13)  
at SubProcess.emit (events.js:191:7)  
at ChildProcess. (…/…/lib/teen\_process.js:197:14)  
at emitTwo (events.js:106:13)  
at ChildProcess.emit (events.js:191:7)  
at Process.ChildProcess.\_handle.onexit (internal/child\_process.js:215:12)  
Error: xcodebuild failed with code 65  
at SubProcess. (…/…/lib/webdriveragent.js:355:25)  
at emitTwo (events.js:106:13)  
at SubProcess.emit (events.js:191:7)  
at ChildProcess. (…/…/lib/teen\_process.js:197:14)  
at emitTwo (events.js:106:13)  
at ChildProcess.emit (events.js:191:7)  
at Process.ChildProcess.\_handle.onexit (internal/child\_process.js:215:12)  
[XCUITest] Shutting down sub-processes  
[XCUITest] Shutting down Logger process (pid 4738)  
[XCUITest] System log exited with code ‘0’  
[debug] [XCUITest] Running ios real device reset flow  
[debug] [XCUITest] Resetting simulator  
[debug] [iOSLog] Stopping iOS log capture  
[MJSONWP] Encountered internal error running command: Error: xcodebuild failed with code 65  
at SubProcess. (…/…/lib/webdriveragent.js:355:25)  
at emitTwo (events.js:106:13)  
at SubProcess.emit (events.js:191:7)  
at ChildProcess. (…/…/lib/teen\_process.js:197:14)  
at emitTwo (events.js:106:13)  
at ChildProcess.emit (events.js:191:7)  
at Process.ChildProcess.\_handle.onexit (internal/child\_process.js:215:12)  
[HTTP] \<-- POST /wd/hub/session 500 10758 ms - 167

Note: I have masked the udid & the team id here in the logs.

Please help…!!  
@Cauthon @vani.hosagoudra @pavanbachu @crujzo

Thank you.

---

<div class="post-metadata">

**Author:** ![pavanbachu](https://discuss.appium.io/user_avatar/discuss.appium.io/pavanbachu/32/5569_2.png) [@pavanbachu](https://discuss.appium.io/u/pavanbachu)\
**Post date:** [December 21, 2016, 4:53pm UTC](https://discuss.appium.io/t/getting-error-linker-command-failed-with-exit-code-1-use-v-to-see-invocation/13894/2 "2016-12-21T16:53:48Z")

</div>

Hey please follow these steps [Xcodebuild failed with code 65 (WARNING: The server did not provide any stacktrace information) Command duration or timeout: 32.63 seconds](https://discuss.appium.io/t/xcodebuild-failed-with-code-65-warning-the-server-did-not-provide-any-stacktrace-information-command-duration-or-timeout-32-63-seconds/12756/3)

---

<div class="post-metadata">

**Author:** ![jtangadagi](https://discuss.appium.io/letter_avatar_proxy/v4/letter/j/cab0a1/32.png) [@jtangadagi](https://discuss.appium.io/u/jtangadagi)\
**Post date:** [December 21, 2016, 5:10pm UTC](https://discuss.appium.io/t/getting-error-linker-command-failed-with-exit-code-1-use-v-to-see-invocation/13894/3 "2016-12-21T17:10:07Z")

</div>

Hi @pavanbachu, I tried to install carthage using your instructions:

cd /usr/local/lib/node\_modules/appium/node\_modules/appium-xcuitest-driver/WebDriverAgent/  
$ npm install -g carthage --HEAD  
$ open

But, getting the following error on the Terminal :

 ![](https://discuss.appium.io/uploads/default/original/2X/f/f31056b4bbf5905744481d21c2e1b31d9e1639da.png)

Can you please guide me on this?

---

<div class="post-metadata">

**Author:** ![crujzo](https://discuss.appium.io/letter_avatar_proxy/v4/letter/c/5f8ce5/32.png) [@crujzo](https://discuss.appium.io/u/crujzo)\
**Post date:** [December 22, 2016, 3:42am UTC](https://discuss.appium.io/t/getting-error-linker-command-failed-with-exit-code-1-use-v-to-see-invocation/13894/4 "2016-12-22T03:42:38Z")

</div>

First : try with sudo, if not then,  
Second: just install carthage in your from your root folder it will install it in the default location : which will be usr/local/Cellar and that should work

Please let us know if it doesn’t work.

---

<div class="post-metadata">

**Author:** ![pavanbachu](https://discuss.appium.io/user_avatar/discuss.appium.io/pavanbachu/32/5569_2.png) [@pavanbachu](https://discuss.appium.io/u/pavanbachu)\
**Post date:** [December 22, 2016, 6:09am UTC](https://discuss.appium.io/t/getting-error-linker-command-failed-with-exit-code-1-use-v-to-see-invocation/13894/5 "2016-12-22T06:09:26Z")

</div>

It’s brew install carthage

---

<div class="post-metadata">

**Author:** ![jtangadagi](https://discuss.appium.io/letter_avatar_proxy/v4/letter/j/cab0a1/32.png) [@jtangadagi](https://discuss.appium.io/u/jtangadagi)\
**Post date:** [December 22, 2016, 3:39pm UTC](https://discuss.appium.io/t/getting-error-linker-command-failed-with-exit-code-1-use-v-to-see-invocation/13894/6 "2016-12-22T15:39:49Z")

</div>

Hi,

@pavanbachu : I tried **brew install carthage** in the WebDriverAgent location as shown below in the screenshot - din’t work, got the following error :

![](https://discuss.appium.io/uploads/default/original/2X/a/af22ab0894053da5c65d4e119dd9061418e2b019.png)

@crujzo : I tried **sudo npm install -g carthage --HEAD** but got this following error again :

![](https://discuss.appium.io/uploads/default/original/2X/b/b1b8ee2917c939f47df18320445f1d7c0f509cad.png)

Next, I tried **brew install carthage** from the root folder and got the below output for this : ![](https://discuss.appium.io/uploads/default/original/2X/d/d5ab7b38e1055aef13e3e0321580542018a28f91.png)

I see a **carthage** folder here in this location /usr/local/Cellar.

Even after performing all these - I am still facing the same issue. Please help…!! And also please let me know if I was wrong somewhere in your above guidelines. @pavanbachu @crujzo

---

<div class="post-metadata">

**Author:** ![crujzo](https://discuss.appium.io/letter_avatar_proxy/v4/letter/c/5f8ce5/32.png) [@crujzo](https://discuss.appium.io/u/crujzo)\
**Post date:** [December 23, 2016, 3:48am UTC](https://discuss.appium.io/t/getting-error-linker-command-failed-with-exit-code-1-use-v-to-see-invocation/13894/7 "2016-12-23T03:48:39Z")

</div>

@jtangadagi I believe the location is : **/usr/local/lib/node\_modules/appium-xcuitest-driver/WebDriverAgent**

![](https://discuss.appium.io/uploads/default/original/2X/b/b5b6a128522b91d857f07dde36c634a986767b78.png)

---

<div class="post-metadata">

**Author:** ![pavanbachu](https://discuss.appium.io/user_avatar/discuss.appium.io/pavanbachu/32/5569_2.png) [@pavanbachu](https://discuss.appium.io/u/pavanbachu)\
**Post date:** [December 25, 2016, 3:37pm UTC](https://discuss.appium.io/t/getting-error-linker-command-failed-with-exit-code-1-use-v-to-see-invocation/13894/8 "2016-12-25T15:37:43Z")

</div>

@jtangadagi Did you try executing after installing carthage ?  
Did you install ios-deploy (if not brew install ios-deploy)

---

<div class="post-metadata">

**Author:** ![jtangadagi](https://discuss.appium.io/letter_avatar_proxy/v4/letter/j/cab0a1/32.png) [@jtangadagi](https://discuss.appium.io/u/jtangadagi)\
**Post date:** [December 27, 2016, 4:47pm UTC](https://discuss.appium.io/t/getting-error-linker-command-failed-with-exit-code-1-use-v-to-see-invocation/13894/9 "2016-12-27T16:47:36Z")

</div>

@crujzo : But, I have the WebdriverAgent located in the following location : **/usr/local/lib/node\_modules/appium/node\_modules/appium-xcuitest-driver/WebDriverAgent**  
 ![](https://discuss.appium.io/uploads/default/original/2X/6/6ff9483f80e3bd452761af7dc91ff30b30e11e22.png)

If I try the location what you have specified, I dont find the WebDriverAgent here.  
Location specified by you : **/usr/local/lib/node\_modules/appium-xcuitest-driver/WebDriverAgent**  
 ![](https://discuss.appium.io/uploads/default/original/2X/e/e05943a7309d1c5f1303500c48f3f68a55289c3f.png)

So, to give an overview about the locations of the WebDriverAgent,  
Your’s : **/usr/local/lib/node\_modules/appium-xcuitest-driver/WebDriverAgent**  
Mine : **/usr/local/lib/node\_modules/appium/node\_modules/appium-xcuitest-driver/WebDriverAgent**

This is the difference. Can you please help me from here?

---

<div class="post-metadata">

**Author:** ![jtangadagi](https://discuss.appium.io/letter_avatar_proxy/v4/letter/j/cab0a1/32.png) [@jtangadagi](https://discuss.appium.io/u/jtangadagi)\
**Post date:** [December 27, 2016, 4:50pm UTC](https://discuss.appium.io/t/getting-error-linker-command-failed-with-exit-code-1-use-v-to-see-invocation/13894/10 "2016-12-27T16:50:15Z")

</div>

Hi @pavanbachu, Yes I tried the install iso-deploy using **npm install -g iso-deploy** and got installed successfully on the Terminal.

---

<div class="post-metadata">

**Author:** ![pavanbachu](https://discuss.appium.io/user_avatar/discuss.appium.io/pavanbachu/32/5569_2.png) [@pavanbachu](https://discuss.appium.io/u/pavanbachu)\
**Post date:** [December 28, 2016, 9:23pm UTC](https://discuss.appium.io/t/getting-error-linker-command-failed-with-exit-code-1-use-v-to-see-invocation/13894/11 "2016-12-28T21:23:27Z")

</div>

Please uninstall the Appium from your MAC and retry these steps

**Capabilities:**

```
		capabilities.setCapability("automationName", "XCUITest");
		capabilities.setCapability("platformVersion", "10.1");
	    capabilities.setCapability("xcodeConfigFile",“/path/to/Configfile.xcconfig");

```

**Installation:**  
Ios-deploy: brew install ios-deploy  
Carthage: brew install carthage

**Install Appium** : npm install -g appium

**Dependencies:**  
cd /usr/local/lib/node\_modules/appium/node\_modules/appium-xcuitest-driver/WebDriverAgent/  
/bin/bash Scripts/bootstrap.sh -d

**Change the Xcode Version to XCODE 8** : sudo xcode-select --switch /path/to/Xcode.app/ (incase you have more than one xcode installed)`

---

<div class="post-metadata">

**Author:** ![jtangadagi](https://discuss.appium.io/letter_avatar_proxy/v4/letter/j/cab0a1/32.png) [@jtangadagi](https://discuss.appium.io/u/jtangadagi)\
**Post date:** [December 28, 2016, 10:03pm UTC](https://discuss.appium.io/t/getting-error-linker-command-failed-with-exit-code-1-use-v-to-see-invocation/13894/12 "2016-12-28T22:03:30Z")

</div>

Hi @pavanbachu, I now uninstalled appium 1.6.3 from my MAC. Should I follow your above steps first and then install appium 1.6.3 again or first re-install appium 1.6.3 and perform the above steps?

Please guide me.

---

<div class="post-metadata">

**Author:** ![jtangadagi](https://discuss.appium.io/letter_avatar_proxy/v4/letter/j/cab0a1/32.png) [@jtangadagi](https://discuss.appium.io/u/jtangadagi)\
**Post date:** [January 4, 2017, 5:40pm UTC](https://discuss.appium.io/t/getting-error-linker-command-failed-with-exit-code-1-use-v-to-see-invocation/13894/13 "2017-01-04T17:40:16Z")

</div>

Hi @pavanbachu, I tried to follow your steps and made an attempt to uninstall & re-install appium a/c to your steps, I now again see a different build failure in Xcode. I have attached the screenshot below for your reference.

 ![](https://discuss.appium.io/uploads/default/original/2X/9/9a8a96bd7a412b85dc6f8c17580582f9a825d40a.png)

Can you please guide me on how to fix this issue?

---

<div class="post-metadata">

**Author:** ![pavanbachu](https://discuss.appium.io/user_avatar/discuss.appium.io/pavanbachu/32/5569_2.png) [@pavanbachu](https://discuss.appium.io/u/pavanbachu)\
**Post date:** [January 4, 2017, 7:10pm UTC](https://discuss.appium.io/t/getting-error-linker-command-failed-with-exit-code-1-use-v-to-see-invocation/13894/14 "2017-01-04T19:10:43Z")

</div>

Can you please download the dependencies before pushing the Webdriver Agent  
app

---

<div class="post-metadata">

**Author:** ![jtangadagi](https://discuss.appium.io/letter_avatar_proxy/v4/letter/j/cab0a1/32.png) [@jtangadagi](https://discuss.appium.io/u/jtangadagi)\
**Post date:** [January 4, 2017, 7:16pm UTC](https://discuss.appium.io/t/getting-error-linker-command-failed-with-exit-code-1-use-v-to-see-invocation/13894/15 "2017-01-04T19:16:14Z")

</div>

Are you referring to these dependencies specified by you?

**Dependencies:** cd /usr/local/lib/node\_modules/appium/node\_modules/appium-xcuitest-driver/WebDriverAgent//bin/bash Scripts/bootstrap.sh -d

---

<div class="post-metadata">

**Author:** ![jtangadagi](https://discuss.appium.io/letter_avatar_proxy/v4/letter/j/cab0a1/32.png) [@jtangadagi](https://discuss.appium.io/u/jtangadagi)\
**Post date:** [January 4, 2017, 7:34pm UTC](https://discuss.appium.io/t/getting-error-linker-command-failed-with-exit-code-1-use-v-to-see-invocation/13894/16 "2017-01-04T19:34:43Z")

</div>

I had done this before and it looked like this ![](https://discuss.appium.io/uploads/default/original/2X/6/65624f37a204cca90d3026f0988e2d6842af676e.png)

Please let me know if this is right.!!
